{"text_format":"1","workbook":"xlsx","n_sheets":4,"sheets":["A SAVOIR","SAISIE","referentiels","TradXML"],"not_rendered":{"charts":0,"images":2,"macros":1,"external_links":1,"defined_names":23,"comments":0,"pivot_tables":0},"unopened":[],"bounds":{"document_bytes":16777216,"sheet_cells":100000,"rows_first":2000,"rows_last":500,"rows_between":2000,"halvings":0,"cell_chars":16384,"cell_head_chars":4096},"cells_cut":0,"cells_raw":0,"read":"whole","date_system":"1900"}

{"sheet":"A SAVOIR","index":0,"n_rows":24,"n_cols":3,"rows_kept":24,"cut":false,"hidden":false,"merged":[[22,1,22,2],[23,1,23,2],[1,1,1,2],[3,1,3,2],[5,1,5,2],[9,1,9,2],[15,1,15,2]]}
[]
[null,"FORMULAIRE DE DECLARATION DE LA PATENTE TRANSPORT (DGE)"]
[]
[null,"Ce fichier Excel vous permet de générer un fichier XML à transmettre ensuite sur e-Impôts pour les patentes transport de l'ensemble de vos véhicules."]
[]
[null,"IMPORTANT : veillez à bien activer les modifications et appliquer les macros (\"activer le contenu\") à l'ouverture pour pouvoir utiliser ce fichier"]
[]
[]
[]
[null,"Comment générer mon annexe détaillée au format XML ?"]
[null,"#1","Rendez-vous sur la feuille SAISIE de ce fichier Excel"]
[null,"#2","Renseignez votre NCC et sélectionnez l'exercice de la déclaration à effectuer"]
["\n\n","#3","Remplissez le tableau :\n> manuellement\n> ou en procédant par copier/coller depuis un autre fichier Excel (éventuellement exporté de votre système d'information)\nEviter les caractères spéciaux du style /, * , ( ), &, ' (apostrophes) : ils seront normalement ignorés, mais pourraient empêcher l'import de votre fichier sur e-Impôts.\nEviter également d'introduire plusieurs espaces entre les mots et les lignes entièrement vides ou en partie"]
["\n","#4","Vérifiez vos saisies puis générez votre fichier XML en cliquant sur le bouton orange : \"Génération du XML\""]
[]
[null,"Que faire après avoir généré le fichier XML ?"]
[null,"#5","Le fichier XML géneré est déposé dans le répertoire /Documents sur votre poste de travail"]
[null,"#6","Sur e-Impôts, à l'étape 3 de votre déclaration, vous devez importer ce fichier XML dans la section \"Transmission des annexes détaillées par EDI\""]
["\n","#7","Une fois votre fichier chargé, vous pouvez charger les autres pièces jointes si nécessaire (justificatifs divers) et passer à l'étape suivante de votre déclaration.\nVous pourrez alors consulter à l'écran le détail des informations importées.\nUne fois votre télédéclaration transmise, vous pourrez télécharger au format CSV les données que vous avez importées, si vous souhaitez les contrôler."]
[null,"#8","Si votre fichier XML est très volumineux et ne peut être importé sur e-Impôts (taille de fichier trop grande), vous pouvez procéder en plusieurs fois et saisir votre annexe détaillée en plusieurs fois. Un bouton spécifique permet de charger des fichiers complémentaires sur e-Impôts sans écraser les fichiers préalablement importés."]
["\n",null,"Pour information, vous êtes également libre de générer un fichier XML par un autre moyen, si celui-ci respecte scrupuleusement la syntaxe EDI XML e-Impôts et les référentiels présentés dans ce fichier Excel (voir la feuille \"referentiels\")."]
[]
[null,"Avertissement sur le traitement du fichier"]
[null,"La Direction Générale des Impôts certifie que les calculs de Patente transport intégrés à ce fichier respectent les règles du Code Général des Impôts.\nUn contrôle a posteriori est réalisé sur les montants des patentes calculés en fonction des caractéristiques de vos véhicules afin d'éviter toute manipulation des fichiers XML EDI générés par ce fichier."]

{"sheet":"SAISIE","index":1,"n_rows":5014,"n_cols":19,"rows_kept":5014,"cut":false,"hidden":false,"merged":[[1,1,1,16],[3,3,3,5],[4,3,4,5],[5,3,5,5],[9,3,9,13],[9,14,9,16]]}
[null,"Version 1"]
[null,"FORMULAIRE DE GENERATION DES FICHIERS XML POUR LA DECLARATION DE LA PATENTE TRANSPORT EN LIGNE"]
[]
[null,null,"NCC","1100418F",null,null,null,null,{"$f":"IF(S4=0,\"\",\"Respecter le format 1234567A, sans espace. Ajoutez des '0' si besoin (ex : 0012345A).\")","v":""},null,null,null,null,null,null,null,null,null,{"$f":"IFERROR(IF(LEN(ncc)=8,0,IF(LEN(ncc)=0,0,1)),1)","v":0}]
[null,null,"Année de déclaration",2026,null,null,null,null,null,null,null,null,null,null,null,null,null,null,{"$f":"S4+S7+S6","v":14}]
[null,null,"Nature du propriétaire des véhicules","Personne morale",null,null,null,null,null,null,null,null,null,null,null,null,null,{"$f":"IF(S6=1,\"Impossible de déclarer un fichier vide\",\"\")","v":""},{"$f":"IF(COUNTA(C14:C5013)=0,1,0)","v":0}]
[null,null,null,null,null,null,null,null,null,null,null,null,null,null,null,null,null,"Nombre d'erreurs à corriger sur les lignes détails :",{"$f":"SUM(S14:S5001)","v":14}]
[]
[]
[null,null,"Activité","Informations sur le véhicule",null,null,null,null,null,null,null,null,null,null,"Calcul de l'Impôt"]
[null,"#","Nature de l'activité de transport\n(sélection dans la liste)","Nombre de passagers","Charge utile totale du véhicule","Numéro d'immatriculation","Numéro de chassis","Numéro de carte grise","Marque\n(sélection dans la liste)","N° série","Puiss-ance CV","Couleur","Date acquisition","Date de mise en service","Droit sur le Chiffre d'Affaires","Montant de l'impôt BIC","Montant total à payer"]
[null,1]
[null,null,null,null,null,null,null,null,null,null,null,null,null,"TOTAL",{"$f":"SUM(O14:O5013)","v":408000},{"$f":"SUM(P14:P5013)","v":0},{"$f":"SUM(Q14:Q1001)","v":408000}]
[null,{"$f":"B13+1","v":1},"Transport privé de marchandises (pour son propre compte)",5,1,"AB-501-BH-01","W09PRS218CTW86281","CG10703648","Autre","NA-WER",0,"Blanc","2026-04-01","2000-01-15",{"$f":"IFERROR(VLOOKUP(C14,refActivitePatente,2,FALSE)+VLOOKUP(C14,refActivitePatente,3,FALSE)*D14+VLOOKUP(C14,refActivitePatente,4,FALSE)*MAX(E14-VLOOKUP(C14,refActivitePatente,5,FALSE),0),\"\")","v":24000},{"$f":"IFERROR(VLOOKUP(O14,refPatenteBic,3,TRUE)*VLOOKUP(personneType,refPersonneType,2,FALSE)*VLOOKUP(C14,refActivitePatente,6,FALSE),\"\")","v":0},{"$f":"SUM(O14:P14)","v":24000},{"$f":"COUNTA(C14:N14)","v":12},{"$f":"IF(R14=0,\"\",IF(OR(COUNTIF(listeActivite,C14)<1,OR(AND(SUM(D14:E14)=0,AND(LEFT(C14,4)<>\"Corb\",LEFT(C14,4)<>\"Marc\")),AND(E14<1,RIGHT(C14,7)=\"andises\"),AND(NOT(ISERROR(SEARCH(\"*personne*\",C14))),D14<1)),ISBLANK(F14),AND(COUNTIF(listeMarque,I14)<1,MID(C14,11,8)<>\"maritime\"),ISBLANK(K14),ISBLANK(L14),ISBLANK(M14),ISBLANK(N14),COUNTIF($F$14:$F$10000,F14)>1),1,0))","v":0}]
[null,2,"Transport privé de marchandises (pour son propre compte)",5,1,"AB-052-BH-01","XLRAS85MC0E952520","CG10691432","Autre","CF85 410",35,"Blanc","2026-04-01","2026-04-17",24000,0,{"$f":"SUM(O15:P15)","v":24000},{"$f":"COUNTA(C15:N15)","v":12},0]
[null,3,"Transport privé de marchandises (pour son propre compte)",5,1,"AB-577-AN-01","WDB9506431L187815","CG10700470","Mercedes-Benz","ACTROS",32,"Blanc","2026-04-01","2026-03-04",24000,0,24000,12,0]
[null,4,"Transport privé de marchandises (pour son propre compte)",6,null,null,null,null,null,null,null,null,null,null,24000,0,24000,2,1]
[null,5,"Transport privé de marchandises (pour son propre compte)",5,null,null,null,null,null,null,null,null,null,null,24000,0,24000,2,1]
[null,6,"Transport privé de marchandises (pour son propre compte)",5,null,null,null,null,null,null,null,null,null,null,24000,0,24000,2,1]
[null,7,"Transport privé de marchandises (pour son propre compte)",5,null,null,null,null,null,null,null,null,null,null,24000,0,24000,2,1]
[null,8,"Transport privé de marchandises (pour son propre compte)",2,null,null,null,null,null,null,null,null,null,null,24000,0,24000,2,1]
[null,9,"Transport privé de marchandises (pour son propre compte)",5,null,null,null,null,null,null,null,null,null,null,24000,0,24000,2,1]
[null,10,"Transport privé de marchandises (pour son propre compte)",5,null,null,null,null,null,null,null,null,null,null,24000,0,24000,2,1]
[null,11,"Transport privé de marchandises (pour son propre compte)",5,null,null,null,null,null,null,null,null,null,null,24000,0,24000,2,1]
[null,12,"Transport privé de marchandises (pour son propre compte)",5,null,null,null,null,null,null,null,null,null,null,24000,0,24000,2,1]
[null,13,"Transport privé de marchandises (pour son propre compte)",5,null,null,null,null,null,null,null,null,null,null,24000,0,24000,2,1]
[null,14,"Transport privé de marchandises (pour son propre compte)",5,null,null,null,null,null,null,null,null,null,null,24000,0,24000,2,1]
[null,15,"Transport privé de marchandises (pour son propre compte)",3,null,null,null,null,null,null,null,null,null,null,24000,0,24000,2,1]
[null,16,"Transport privé de marchandises (pour son propre compte)",5,null,null,null,null,null,null,null,null,null,null,24000,0,24000,2,1]
[null,17,"Transport privé de marchandises (pour son propre compte)",5,null,null,null,null,null,null,null,null,null,null,24000,0,24000,2,1]
[null,18,null,null,null,null,null,null,null,null,null,null,null,null,"","",0,0,""]
[null,19,null,null,null,null,null,null,null,null,null,null,null,null,"","",0,0,""]
[null,20,null,null,null,null,null,null,null,null,null,null,null,null,"","",0,0,""]
[null,21,null,null,null,null,null,null,null,null,null,null,null,null,"","",0,0,""]
[null,22,null,null,null,null,null,null,null,null,null,null,null,null,"","",0,0,""]
[null,23,null,null,null,null,null,null,null,null,null,null,null,null,"","",0,0,""]
[null,24,null,null,null,null,null,null,null,null,null,null,null,null,"","",0,0,""]
[null,25,null,null,null,null,null,null,null,null,null,null,null,null,"","",0,0,""]
[null,26,null,null,null,null,null,null,null,null,null,null,null,null,"","",0,0,""]
[null,27,null,null,null,null,null,null,null,null,null,null,null,null,"","",0,0,""]
[null,28,null,null,null,null,null,null,null,null,null,null,null,null,"","",0,0,""]
[null,29,null,null,null,null,null,null,null,null,null,null,null,null,"","",0,0,""]
[null,30,null,null,null,null,null,null,null,null,null,null,null,null,"","",0,0,""]
[null,31,null,null,null,null,null,null,null,null,null,null,null,null,"","",0,0,""]
[null,32,null,null,null,null,null,null,null,null,null,null,null,null,"","",0,0,""]
[null,33,null,null,null,null,null,null,null,null,null,null,null,null,"","",0,0,""]
[null,34,null,null,null,null,null,null,null,null,null,null,null,null,"","",0,0,""]
[null,35,null,null,null,null,null,null,null,null,null,null,null,null,"","",0,0,""]
[null,36,null,null,null,null,null,null,null,null,null,null,null,null,"","",0,0,""]
[null,37,null,null,null,null,null,null,null,null,null,null,null,null,"","",0,0,""]
[null,38,null,null,null,null,null,null,null,null,null,null,null,null,"","",0,0,""]
[null,39,null,null,null,null,null,null,null,null,null,null,null,null,"","",0,0,""]
[null,40,null,null,null,null,null,null,null,null,null,null,null,null,"","",0,0,""]
[null,41,null,null,null,null,null,null,null,null,null,null,null,null,"","",0,0,""]
[null,42,null,null,null,null,null,null,null,null,null,null,null,null,"","",0,0,""]
[null,43,null,null,null,null,null,null,null,null,null,null,null,null,"","",0,0,""]
[null,44,null,null,null,null,null,null,null,null,null,null,null,null,"","",0,0,""]
[null,45,null,null,null,null,null,null,null,null,null,null,null,null,"","",0,0,""]
[null,46,null,null,null,null,null,null,null,null,null,null,null,null,"","",0,0,""]
[null,47,null,null,null,null,null,null,null,null,null,null,null,null,"","",0,0,""]
[null,48,null,null,null,null,null,null,null,null,null,null,null,null,"","",0,0,""]
[null,49,null,null,null,null,null,null,null,null,null,null,null,null,"","",0,0,""]
[null,50,null,null,null,null,null,null,null,null,null,null,null,null,"","",0,0,""]
[null,51,null,null,null,null,null,null,null,null,null,null,null,null,"","",0,0,""]
[null,52,null,null,null,null,null,null,null,null,null,null,null,null,"","",0,0,""]
[null,53,null,null,null,null,null,null,null,null,null,null,null,null,"","",0,0,""]
[null,54,null,null,null,null,null,null,null,null,null,null,null,null,"","",0,0,""]
[null,55,null,null,null,null,null,null,null,null,null,null,null,null,"","",0,0,""]
[null,56,null,null,null,null,null,null,null,null,null,null,null,null,"","",0,0,""]
[null,57,null,null,null,null,null,null,null,null,null,null,null,null,"","",0,0,""]
[null,58,null,null,null,null,null,null,null,null,null,null,null,null,"","",0,0,""]
[null,59,null,null,null,null,null,null,null,null,null,null,null,null,"","",0,0,""]
[null,60,null,null,null,null,null,null,null,null,null,null,null,null,"","",0,0,""]
[null,61,null,null,null,null,null,null,null,null,null,null,null,null,"","",0,0,""]
[null,62,null,null,null,null,null,null,null,null,null,null,null,null,"","",0,0,""]
[null,63,null,null,null,null,null,null,null,null,null,null,null,null,"","",0,0,""]
[null,64,null,null,null,null,null,null,null,null,null,null,null,null,"","",0,0,""]
[null,{"$f":"B77+1","v":65},null,null,null,null,null,null,null,null,null,null,null,null,{"$f":"IFERROR(VLOOKUP(C78,refActivitePatente,2,FALSE)+VLOOKUP(C78,refActivitePatente,3,FALSE)*D78+VLOOKUP(C78,refActivitePatente,4,FALSE)*MAX(E78-VLOOKUP(C78,refActivitePatente,5,FALSE),0),\"\")","v":""},{"$f":"IFERROR(VLOOKUP(O78,refPatenteBic,3,TRUE)*VLOOKUP(personneType,refPersonneType,2,FALSE)*VLOOKUP(C78,refActivitePatente,6,FALSE),\"\")","v":""},0,{"$f":"COUNTA(C78:N78)","v":0},{"$f":"IF(R78=0,\"\",IF(OR(COUNTIF(listeActivite,C78)<1,OR(AND(SUM(D78:E78)=0,AND(LEFT(C78,4)<>\"Corb\",LEFT(C78,4)<>\"Marc\")),AND(E78<1,RIGHT(C78,7)=\"andises\"),AND(NOT(ISERROR(SEARCH(\"*personne*\",C78))),D78<1)),ISBLANK(F78),AND(COUNTIF(listeMarque,I78)<1,MID(C78,11,8)<>\"maritime\"),ISBLANK(K78),ISBLANK(L78),ISBLANK(M78),ISBLANK(N78),COUNTIF($F$14:$F$10000,F78)>1),1,0))","v":""}]
[null,66,null,null,null,null,null,null,null,null,null,null,null,null,"","",{"$f":"SUM(O79:P79)","v":0},0,""]
[null,67,null,null,null,null,null,null,null,null,null,null,null,null,"","",0,0,""]
{"$rows_left_out":4935}
{"sheet":"referentiels","index":2,"n_rows":151,"n_cols":14,"rows_kept":151,"cut":false,"hidden":true,"merged":[]}
["personne","tauxBic","id",null,null,null,null,null,"libelle","idRefCouleur",null,"libelle","taux","idRefTypeTraction"]
["Personne physique",0.25,"P",null,null,null,null,null,"Noir",1,null,"Motorisée",1,1]
["Personne morale",0.25,"M",null,null,null,null,null,"Blanc",{"$f":"J2+1","v":2},null,"Animale",0.25,2]
[null,null,null,null,null,null,null,null,"Gris",3]
["libelle","montant_droit_fixe","montant_droit_passager","montant_droit_charge","volume_charge_exonere","isBic","idRefActivitePatente",null,"Orange",4]
["Transport terrestre de personnes",50400,2520,null,0,1,1,null,"Bleu",5]
["Transport maritime de personnes",75600,1008,null,0,1,2,null,"Rouge",6]
["Transport de marchandises",37800,null,1008,2,1,3,null,"Vert",7]
["Transport privé de marchandises (pour son propre compte)",24000,null,1000,3,0,4,null,"Jaune",8]
["Transport mixte : personnes et marchandises",50300,2520,1008,2,1,5,null,"Violet",9]
["Corbillard au Régime Réel d'imposition",24000,null,null,0,1,6,null,"Marron",10]
["Corbillard soumis à un autre Régime d'imposition",206000,null,null,0,1,7,null,"Beige",11]
["Marchand forain",226800,null,null,0,1,8,null,"Rose",12]
[]
["droit_plancher","droit_plafond","base_bic_forfait",null,"langue Excel"]
[0,75601,300000,null,{"$f":"Langue()","v":1036}]
[75602,151199,400000]
[151200,230999,500000]
[231000,"-",600000]
[]
["Année",null,"codeTaxe","type"]
[{"$f":"YEAR(TODAY())","v":2026},null,"PATTRANS","patente"]
[{"$f":"YEAR(TODAY())-1","v":2025}]
[]
["libelle","groupeOrdre","idRefMarqueVehicule"]
["Alfa Romeo",1,1]
["Audi",1,{"$f":"C26+1","v":2}]
["BMW",1,{"$f":"C27+1","v":3}]
["Chevrolet",1,{"$f":"C28+1","v":4}]
["Citroën",1,{"$f":"C29+1","v":5}]
["Dacia",1,6]
["Daihatsu",1,7]
["Datsun",1,8]
["Fiat",1,9]
["Ford",1,10]
["Honda",1,11]
["Hyundai",1,12]
["Infiniti",1,13]
["Isuzu",1,14]
["Jeep",1,15]
["Kia",1,16]
["Lada",1,17]
["Lancia",1,18]
["Land Rover",1,19]
["Lexus",1,20]
["Mazda",1,21]
["Mercedes-Benz",1,22]
["Mitsubishi",1,23]
["Nissan",1,24]
["Opel",1,25]
["Peugeot",1,26]
["Renault",1,27]
["Seat",1,28]
["Skoda",1,29]
["SsangYong",1,30]
["Suzuki",1,31]
["Toyota",1,32]
["Vauxhall",1,33]
["Volkswagen",1,34]
["Volvo",1,35]
["Abarth",3,36]
["Acura",3,37]
["Alpina",3,38]
["Alpine",3,39]
["AMG",3,40]
["Aston Martin",3,41]
["Bentley",3,42]
["Brabus",3,43]
["Brilliance",3,44]
["Bugatti",3,45]
["Buick",3,46]
["Byton",3,47]
["Cadillac",3,48]
["Caterham",3,49]
["Chery",3,50]
["Chrysler",3,51]
["COURB",3,52]
["Cupra",3,53]
["Dallara",3,54]
["Derways",3,55]
{"$rows_left_out":72}
{"sheet":"TradXML","index":3,"n_rows":5002,"n_cols":20,"rows_kept":5002,"cut":false,"hidden":true,"merged":[]}
[1,{"$f":"\"<?xml version=\"\"1.0\"\" encoding=\"\"UTF-8\"\"?><EDI><informations><type>\"&type&\"</type><ncc>\"&ncc&\"</ncc><codeTaxe>\"&codeTaxe&\"</codeTaxe><mois>1</mois><exercice>\"&exercice&\"</exercice></informations><tableaux><tableau><donnees>\"","v":"<?xml version=\"1.0\" encoding=\"UTF-8\"?><EDI><informations><type>patente</type><ncc>1100418F</ncc><codeTaxe>PATTRANS</codeTaxe><mois>1</mois><exercice>2026</exercice></informations><tableaux><tableau><donnees>"},"idRefPersonneType","idRefActivitePatente","nombre_passager","charge","immatriculation","chassis","carte_grise","idRefMarqueVehicule","numero_serie","puissance_en_cv","idRefTypeTraction","idRefCouleur","date_acquisition","date_mise_en_service","montant_droit","montant_bic","montant_total","idDoc"]
[{"$f":"IF(B2=\"\",\"\",MAX(A1:A$1)+1)","v":2},{"$f":"IF(SAISIE!R14=0,\"\",\"<ligne>\"&C2&D2&E2&F2&G2&H2&I2&J2&K2&L2&M2&N2&O2&P2&Q2&R2&S2&T2&\"</ligne>\")","v":"<ligne><champ><code>idRefPersonneType</code><valeur>M</valeur></champ><champ><code>idRefActivitePatente</code><valeur>4</valeur></champ><champ><code>nombre_passager</code><valeur>5</valeur></champ><champ><code>charge</code><valeur>1</valeur></champ><champ><code>immatriculation</code><valeur>AB-501-BH-01</valeur></champ><champ><code>chassis</code><valeur>W09PRS218CTW86281</valeur></champ><champ><code>carte_grise</code><valeur>CG10703648</valeur></champ><champ><code>idRefMarqueVehicule</code><valeur>126</valeur></champ><champ><code>numero_serie</code><valeur>NA-WER</valeur></champ><champ><code>puissance_en_cv</code><valeur>0</valeur></champ><champ><code>idRefTypeTraction</code><valeur>1</valeur></champ><champ><code>idRefCouleur</code><valeur>2</valeur></champ><champ><code>date_acquisition</code><valeur>01/04/2026</valeur></champ><champ><code>date_mise_en_service</code><valeur>15/01/2000</valeur></champ><champ><code>montant_droit</code><valeur>24000</valeur></champ><champ><code>montant_bic</code><valeur>0</valeur></champ><champ><code>montant_total</code><valeur>24000</valeur></champ><champ><code>idDoc</code><valeur>0</valeur></champ></ligne>"},{"$f":"\"<champ><code>\"&C$1&\"</code><valeur>\"&VLOOKUP(personneType,refPersonneType,3,FALSE)&\"</valeur></champ>\"","v":"<champ><code>idRefPersonneType</code><valeur>M</valeur></champ>"},{"$f":"\"<champ><code>\"&D$1&\"</code><valeur>\"&VLOOKUP(SAISIE!C14,refActivitePatente,7,FALSE)&\"</valeur></champ>\"","v":"<champ><code>idRefActivitePatente</code><valeur>4</valeur></champ>"},{"$f":"\"<champ><code>\"&E$1&\"</code><valeur>\"&IF(ISNUMBER(SAISIE!D14),SAISIE!D14,0)&\"</valeur></champ>\"","v":"<champ><code>nombre_passager</code><valeur>5</valeur></champ>"},{"$f":"\"<champ><code>\"&F$1&\"</code><valeur>\"&IF(ISNUMBER(SAISIE!E14),SAISIE!E14,0)&\"</valeur></champ>\"","v":"<champ><code>charge</code><valeur>1</valeur></champ>"},{"$f":"\"<champ><code>\"&G$1&\"</code><valeur>\"&SAISIE!F14&\"</valeur></champ>\"","v":"<champ><code>immatriculation</code><valeur>AB-501-BH-01</valeur></champ>"},{"$f":"\"<champ><code>\"&H$1&\"</code><valeur>\"&SAISIE!G14&\"</valeur></champ>\"","v":"<champ><code>chassis</code><valeur>W09PRS218CTW86281</valeur></champ>"},{"$f":"\"<champ><code>\"&I$1&\"</code><valeur>\"&SAISIE!H14&\"</valeur></champ>\"","v":"<champ><code>carte_grise</code><valeur>CG10703648</valeur></champ>"},{"$f":"\"<champ><code>\"&J$1&\"</code><valeur>\"&IFERROR(VLOOKUP(SAISIE!I14,refMarqueVehicule,3,FALSE),\"\")&\"</valeur></champ>\"","v":"<champ><code>idRefMarqueVehicule</code><valeur>126</valeur></champ>"},{"$f":"\"<champ><code>\"&K$1&\"</code><valeur>\"&SAISIE!J14&\"</valeur></champ>\"","v":"<champ><code>numero_serie</code><valeur>NA-WER</valeur></champ>"},{"$f":"\"<champ><code>\"&L$1&\"</code><valeur>\"&IF(ISNUMBER(SAISIE!K14),SAISIE!K14,0)&\"</valeur></champ>\"","v":"<champ><code>puissance_en_cv</code><valeur>0</valeur></champ>"},{"$f":"\"<champ><code>\"&M$1&\"</code><valeur>1</valeur></champ>\"","v":"<champ><code>idRefTypeTraction</code><valeur>1</valeur></champ>"},{"$f":"\"<champ><code>\"&N$1&\"</code><valeur>\"&VLOOKUP(SAISIE!L14,refCouleur,2,FALSE)&\"</valeur></champ>\"","v":"<champ><code>idRefCouleur</code><valeur>2</valeur></champ>"},{"$f":"\"<champ><code>\"&O$1&\"</code><valeur>\"&IF(SAISIE!C14<>\"\",IFERROR(IFERROR(TEXT(SAISIE!M14,\"jj/mm/aaaa\"),TEXT(SAISIE!M14,\"dd/mm/yyyy\")),DATE(YEAR(TODAY()),MONTH(TODAY())-1,1)),\"\")&\"</valeur></champ>\"","v":"<champ><code>date_acquisition</code><valeur>01/04/2026</valeur></champ>"},{"$f":"\"<champ><code>\"&P$1&\"</code><valeur>\"&IF(SAISIE!C14<>\"\",IFERROR(IFERROR(TEXT(SAISIE!N14,\"jj/mm/aaaa\"),TEXT(SAISIE!N14,\"dd/mm/yyyy\")),DATE(YEAR(TODAY()),MONTH(TODAY())-1,1)),\"\")&\"</valeur></champ>\"","v":"<champ><code>date_mise_en_service</code><valeur>15/01/2000</valeur></champ>"},{"$f":"\"<champ><code>\"&Q$1&\"</code><valeur>\"&ROUND(SAISIE!O14,0)&\"</valeur></champ>\"","v":"<champ><code>montant_droit</code><valeur>24000</valeur></champ>"},{"$f":"\"<champ><code>\"&R$1&\"</code><valeur>\"&ROUND(SAISIE!P14,0)&\"</valeur></champ>\"","v":"<champ><code>montant_bic</code><valeur>0</valeur></champ>"},{"$f":"\"<champ><code>\"&S$1&\"</code><valeur>\"&ROUND(SAISIE!Q14,0)&\"</valeur></champ>\"","v":"<champ><code>montant_total</code><valeur>24000</valeur></champ>"},{"$f":"\"<champ><code>\"&T$1&\"</code><valeur>\"&0&\"</valeur></champ>\"","v":"<champ><code>idDoc</code><valeur>0</valeur></champ>"}]
[]
[]
[]
[]
[]
[]
[]
[]
[]
[]
[]
[]
[]
[]
[]
[]
[]
[]
[]
[]
[]
[]
[]
[]
[]
[]
[]
[]
[]
[]
[]
[]
[]
[]
[]
[]
[]
[]
[]
[]
[]
[]
[]
[]
[]
[]
[]
[]
[]
[]
[]
[]
[]
[]
[]
[]
[]
[]
[]
[]
[]
[]
[]
[]
[]
[]
[]
[]
[]
[]
[]
[]
[]
[]
[]
[]
[]
[]
{"$rows_left_out":4922}